{"text_format":"1","workbook":"xlsx","n_sheets":29,"sheets":["Input Sheet","Input Sheet (2)","Shipping Check","Pallet 1","Pallet 2","Pallet 3","Pallet 4","Pallet 5","Pallet 6","Pallet 7","Pallet 8","Pallet 9","Pallet 10","Pallet 11","Pallet 12","Pallet 13","Pallet 14","Pallet 15","Pallet 16","Pallet 17","Pallet 18","Pallet 19","Pallet 20","Pallet 21","Pallet 22","Pallet 23","Pallet 24","Pallet 25","Pallet 26"],"not_rendered":{"charts":0,"images":0,"macros":1,"external_links":0,"defined_names":29,"comments":0,"pivot_tables":0},"unopened":[],"bounds":{"document_bytes":16777216,"sheet_cells":100000,"rows_first":2000,"rows_last":500,"rows_between":2000,"halvings":0,"cell_chars":16384,"cell_head_chars":4096},"cells_cut":0,"cells_raw":0,"read":"whole","date_system":"1900"}

{"sheet":"Input Sheet","index":0,"n_rows":150,"n_cols":10,"rows_kept":150,"cut":false,"hidden":false,"merged":[[3,1,3,2]]}
["Placard Creator for Restaurant Depot Shipments"]
[]
[]
["Pallet #'s","Pallet Sequence #'s",null,"Store #","PO#","Product #","Description"]
[1,null,null,null,null,null,{"$f":"_xlfn.IFNA(VLOOKUP(F5,F$149:G$150,2,1),\"Enter Product # in Column f\")","v":"Enter Product # in Column f"}]
[2,null,null,null,null,null,"Enter Product # in Column f"]
[3,null,null,null,null,null,"Enter Product # in Column f",null,null," "]
[4,null,null,null,null,null,"Enter Product # in Column f"]
[5,null,null,null,null,null,"Enter Product # in Column f"]
[6,null,null,null,null,null,{"$f":"_xlfn.IFNA(VLOOKUP(F10,F$149:G$150,2,1),\"Enter Product # in Column f\")","v":"Enter Product # in Column f"}]
[7,null,null,null,null,null,{"$f":"_xlfn.IFNA(VLOOKUP(F11,F$149:G$150,2,1),\"Enter Product # in Column f\")","v":"Enter Product # in Column f"}]
[8,null,null,null,null,null,"Enter Product # in Column f"]
[9,null,null,null,null,null,"Enter Product # in Column f"]
[10,null,null,null,null,null,{"$f":"_xlfn.IFNA(VLOOKUP(F14,F$149:G$150,2,1),\"Enter Product # in Column f\")","v":"Enter Product # in Column f"}]
[11,null,null,null,null,null,"Enter Product # in Column f"]
[12,null,null,null,null,null,"Enter Product # in Column f"]
[13,null,null,null,null,null,"Enter Product # in Column f"]
[14,null,null,null,null,null,"Enter Product # in Column f"]
[15,null,null,null,null,null,"Enter Product # in Column f"]
[16,null,null,null,null,null,"Enter Product # in Column f"]
[17,null,null,null,null,null,"Enter Product # in Column f"]
[18,null,null,null,null,null,"Enter Product # in Column f"]
[19,null,null,null,null,null,"Enter Product # in Column f"]
[20,null,null,null,null,null,"Enter Product # in Column f"]
[21,null,null,null,null,null,"Enter Product # in Column f"]
[22,null,null,null,null,null,"Enter Product # in Column f"]
[23,null,null,null,null,null,"Enter Product # in Column f"]
[24,null,null,null,null,null,"Enter Product # in Column f"]
[25,null,null,null,null,null,"Enter Product # in Column f"]
[26,null,null,null,null,null,"Enter Product # in Column f"]
[]
[null,null,null,null,null,null,{"$f":"_xlfn.IFNA(VLOOKUP(F32,F$149:G$150,2,1),\"Enter Product # in Column f\")","v":"Enter Product # in Column f"}]
[]
[null,null,null,null,null," "]
[]
[null,null,"(Click to select all Pallets -> Click File + Print)"]
[]
[null,null,null,null,null,null,"Total of FRD001",1700]
[null,null,null,null,null,null,"Total of FRD004S",900]
[]
[]
[]
[]
[]
[]
[]
[]
[]
[]
[]
[]
[]
[]
[]
[]
[]
[]
[]
[]
[]
[]
[]
[]
[]
[]
[]
[]
[]
[]
[]
[]
[]
[]
[]
[]
[]
[]
[]
[]
[]
[]
[]
[]
[]
[]
[]
[]
[]
[]
[]
[]
[]
[]
[]
[]
[]
[]
[]
[]
[]
[]
[]
[]
[]
[]
[]
[]
[]
[]
[]
[]
[]
[]
[]
[]
[]
[]
[]
[]
[]
[]
[]
[]
[]
[]
[]
[]
[]
[]
[]
[]
[]
[]
[]
[]
[]
[]
[]
[]
[]
[]
[]
[]
[]
[]
[]
[]
[null,null,null,null,null,"Part #'s","Description"]
[null,null,null,null,null,"FRD001","SWEET POTATO FRIES STRAIGHT CUT"]
[null,null,null,null,null,"FRD004S","SWEET POTATO FRIES PLATTER CUT"]

{"sheet":"Input Sheet (2)","index":1,"n_rows":162,"n_cols":8,"rows_kept":162,"cut":false,"hidden":false,"merged":[]}
[]
[]
[]
["Store #","PO#","Product #","QTY","ADDRESS"]
[{"$f":"'Input Sheet'!D5","v":0},{"$f":"'Input Sheet'!E5","v":0},{"$f":"'Input Sheet'!F5","v":0},100,{"$f":"_xlfn.IFNA(VLOOKUP(A5,D$106:E$158,2,1),\"Enter Store # in Column D\")","v":"Enter Store # in Column D"}]
[{"$f":"'Input Sheet'!D6","v":0},{"$f":"'Input Sheet'!E6","v":0},{"$f":"'Input Sheet'!F6","v":0},100,{"$f":"_xlfn.IFNA(VLOOKUP(A6,D$106:E$158,2,1),\"Enter Store # in Column D\")","v":"Enter Store # in Column D"}]
[{"$f":"'Input Sheet'!D7","v":0},{"$f":"'Input Sheet'!E7","v":0},{"$f":"'Input Sheet'!F7","v":0},100,{"$f":"_xlfn.IFNA(VLOOKUP(A7,D$106:E$158,2,1),\"Enter Store # in Column D\")","v":"Enter Store # in Column D"},null,null," "]
[{"$f":"'Input Sheet'!D8","v":0},{"$f":"'Input Sheet'!E8","v":0},{"$f":"'Input Sheet'!F8","v":0},100,"Enter Store # in Column D"]
[{"$f":"'Input Sheet'!D9","v":0},{"$f":"'Input Sheet'!E9","v":0},{"$f":"'Input Sheet'!F9","v":0},100,"Enter Store # in Column D"]
[{"$f":"'Input Sheet'!D10","v":0},{"$f":"'Input Sheet'!E10","v":0},{"$f":"'Input Sheet'!F10","v":0},100,"Enter Store # in Column D"]
[{"$f":"'Input Sheet'!D11","v":0},{"$f":"'Input Sheet'!E11","v":0},{"$f":"'Input Sheet'!F11","v":0},100,"Enter Store # in Column D"]
[{"$f":"'Input Sheet'!D12","v":0},{"$f":"'Input Sheet'!E12","v":0},{"$f":"'Input Sheet'!F12","v":0},100,"Enter Store # in Column D"]
[{"$f":"'Input Sheet'!D13","v":0},{"$f":"'Input Sheet'!E13","v":0},{"$f":"'Input Sheet'!F13","v":0},100,"Enter Store # in Column D"]
[{"$f":"'Input Sheet'!D14","v":0},{"$f":"'Input Sheet'!E14","v":0},{"$f":"'Input Sheet'!F14","v":0},100,"Enter Store # in Column D"]
[{"$f":"'Input Sheet'!D15","v":0},{"$f":"'Input Sheet'!E15","v":0},{"$f":"'Input Sheet'!F15","v":0},100,"Enter Store # in Column D"]
[{"$f":"'Input Sheet'!D16","v":0},{"$f":"'Input Sheet'!E16","v":0},{"$f":"'Input Sheet'!F16","v":0},100,"Enter Store # in Column D"]
[{"$f":"'Input Sheet'!D17","v":0},{"$f":"'Input Sheet'!E17","v":0},{"$f":"'Input Sheet'!F17","v":0},100,"Enter Store # in Column D"]
[{"$f":"'Input Sheet'!D18","v":0},{"$f":"'Input Sheet'!E18","v":0},{"$f":"'Input Sheet'!F18","v":0},100,"Enter Store # in Column D"]
[{"$f":"'Input Sheet'!D19","v":0},{"$f":"'Input Sheet'!E19","v":0},{"$f":"'Input Sheet'!F19","v":0},100,"Enter Store # in Column D"]
[{"$f":"'Input Sheet'!D20","v":0},{"$f":"'Input Sheet'!E20","v":0},{"$f":"'Input Sheet'!F20","v":0},100,"Enter Store # in Column D"]
[{"$f":"'Input Sheet'!D21","v":0},{"$f":"'Input Sheet'!E21","v":0},{"$f":"'Input Sheet'!F21","v":0},100,"Enter Store # in Column D"]
[{"$f":"'Input Sheet'!D22","v":0},{"$f":"'Input Sheet'!E22","v":0},{"$f":"'Input Sheet'!F22","v":0},100,"Enter Store # in Column D"]
[{"$f":"'Input Sheet'!D23","v":0},{"$f":"'Input Sheet'!E23","v":0},{"$f":"'Input Sheet'!F23","v":0},100,"Enter Store # in Column D"]
[{"$f":"'Input Sheet'!D24","v":0},{"$f":"'Input Sheet'!E24","v":0},{"$f":"'Input Sheet'!F24","v":0},100,"Enter Store # in Column D"]
[{"$f":"'Input Sheet'!D25","v":0},{"$f":"'Input Sheet'!E25","v":0},{"$f":"'Input Sheet'!F25","v":0},100,"Enter Store # in Column D"]
[{"$f":"'Input Sheet'!D26","v":0},{"$f":"'Input Sheet'!E26","v":0},{"$f":"'Input Sheet'!F26","v":0},100,"Enter Store # in Column D"]
[{"$f":"'Input Sheet'!D27","v":0},{"$f":"'Input Sheet'!E27","v":0},{"$f":"'Input Sheet'!F27","v":0},100,"Enter Store # in Column D"]
[{"$f":"'Input Sheet'!D28","v":0},{"$f":"'Input Sheet'!E28","v":0},{"$f":"'Input Sheet'!F28","v":0},100,"Enter Store # in Column D"]
[{"$f":"'Input Sheet'!D29","v":0},{"$f":"'Input Sheet'!E29","v":0},{"$f":"'Input Sheet'!F29","v":0},100,"Enter Store # in Column D"]
[{"$f":"'Input Sheet'!D30","v":0},{"$f":"'Input Sheet'!E30","v":0},{"$f":"'Input Sheet'!F30","v":0},100,"Enter Store # in Column D"]
[]
[]
[null,"Total of FRD001",null,{"$f":"'Input Sheet'!H38","v":1700}]
[null,"Total of FRD004S",null,{"$f":"'Input Sheet'!H39","v":900}]
[]
[]
[]
[]
[]
[]
[]
[]
[]
[]
[]
[]
[]
[]
[]
[]
[]
[]
[]
[]
[]
[]
[]
[]
[]
[]
[]
[]
[]
[]
[]
[]
[]
[]
[]
[]
[]
[]
[]
[]
[]
[]
[]
[]
[]
[]
[]
[]
[]
[]
[]
[]
[]
[]
[]
[]
[]
[]
[]
[]
[]
[]
[]
[]
[]
[]
[]
[]
[]
[]
[]
[null,null,null,110,"Jetro Cash & Carry #10 566 Hamilton Ave Brooklyn NY 11232"]
[null,null,null,111,"Jetro Cash & Carry #11 1 Amity Street, Jersey City, NJ 07304"]
[null,null,null,112,"Jetro Cash & Carry #12 101-10 Foster Ave. Brooklyn NY 11236"]
[null,null,null,116,"Jetro Cash & Carry #16 700 Pattison Ave. Philadelphia PA 19148"]
[null,null,null,121,"Jetro Cash & Carry #21 15-06 132nd Street College Point NY 11356"]
[null,null,null,125,"Rest Depot/Jetro #25 3405 Annapolis Rd Baltimore MD 21227"]
[null,null,null,144,"Restaurant Depot #44 1335 Lakeland Ave. Bohemia NY 11716"]
[null,null,null,150,"Restaurant Depot #50 114 First Ave. Needham MA 02494"]
[null,null,null,160,"Restaurant Depot #60 140 Kenwood Street Cranston RI 02907"]
[null,null,null,161,"Restaurant Depot #61 650 South Columbus Ave. Mount Vernon NY 10550"]
[null,null,null,163,"Restaurant Depot #63 43-40 57th Ave. Maspeth NY 11378"]
[null,null,null,167,"Restaurant Depot #67 720 Stewart Ave. Garden City NY 11530"]
[null,null,null,171,"Restaurant Depot #71 181 Marsh Hill Rd Orange CT 06477"]
[null,null,null,173,"Restaurant Depot #73 777 Secaucus Rd Secaucus NJ 07094-2511"]
[null,null,null,185,"Restaurant Depot #85 1032 Hampton Par Blvd Capitol Heights MD 20743"]
[null,null,null,194,"Restaurant Depot #94 21 US HWY 46 Pine Brook NJ 07058-9604"]
[null,null,null,801,"Restaurant Depot #801 100 Corporate Dr Blauvelt NY 10913"]
[null,null,null,802,"Restaurant Depot #802 22 Warehouse Row Colonie NY 12205"]
[null,null,null,803,"Restaurant Depot #803 1966 Broad Hollow Rd Farmingdale NY 11735"]
[null,null,null,804,"Restaurant Depot #804 2950 Roberts Ave. Philadelphia PA 19129"]
[null,null,null,805,"Restaurant Depot #805, 5112 Virginia Beach Blvd, Virginia Beach, VA  23462"]
[null,null,null,806,"Restaurant Depot #806 305 South Regent Street Port Chester NY 10573"]
[null,null,null,807,"Restaurant Depot #807 3562 RT 66 Neptune NJ 07753"]
[null,null,null,808,"Restaurant Depot #808 1661 East Lincoln Hwy Langhorne PA 19047"]
[null,null,null,809,"Restaurant Depot #809 7951 Brook Rd Richmond VA 23227"]
[null,null,null,810,"Restaurant Depot #810 200 Cornel Drive Wilmington DE 19801"]
[null,null,null,811,"Restaurant Depot #811 30 Bodwell Street Avon MA 02322"]
[null,null,null,812,"Restaurant Depot #812 2002 Industrial Drive Bethlehem PA 18017"]
[null,null,null,814,"Restaurant Depot #814 146 Dascomb Rd Andover MA 01810 "]
[null,null,null,815,"Jetro Cash & Carry #815, 123 First Ave., Chicopee, MA  01020"]
[null,null,null,816,"Restaurant Depot #816, 4250 Chambers Hill Road, Harrisburg, Pa  17111"]
[null,null,null,817,"RestaurantDepot #817, 4420 Brookfield Corporate Drive, Chantilly, VA  20151"]
[null,null,null,818,"Jetro Cash & Carry #818 100 Oak Point Ave Bronx NY 10474"]
[null,null,null,819,"Restaurant Depot #819 1281 Route 300 Newburg NY 12550"]
[null,null,null,820,"Restaurant Depot #820 3580 E Main Street Waterbury CT 06705"]
[null,null,null,821,"Restaurant Depot #821, 3711 Danbury Road, Brewster, NY. 10509"]
[null,null,null,822,"Restaurant Depot #822, 100 Deer St., Milford, Ma  01757"]
[null,null,null,823,"Restaurant Depot #823, 650 Scott Street, Wilkes-Barre, Pa 18705"]
[null,null,null,824,"Restaurant Depot #824, 1801 South Ave, Staten Island, NY. 10314"]
[null,null,null,826,"Restaurant Depot #826, 6725 E. Black Horse Pike, Egg Harbor Twsp, NJ. 08234"]
[null,null,null,827,"Restaurant Depot #827, 3045 N. 5th Street Hwy, Reading, PA 19605"]
[null,null,null,828,"Restaurant Depot #828, 82 Buckwalter Rd, Bld 200, Royersford, PA.19468"]
[null,null,null,830,"Restaurant Depot #830 500 Kings Hwy, New Bedford, MA. 02745"]
[null,null,null,832,"Restaurant Depot #832 1135 Springfield Rd Union NJ 07083"]
[null,null,null,834,"Restaurant Depot #834 82 Boston Street Everett MA 02149"]
[null,null,null,835,"Restaurant Depot #835, 135 Merrit Way, Whitemarsh, MD. 21162"]
[null,null,null,852,"Restaurant Depot #852 1070 Thomas busch Mem Pwy Pennsauken NJ 08110"]
[null,null,null,855,"Restaurant Depot #855 4600 Eisenhower Ave Alexandria VA 22304"]
[null,null,null,874,"Restaurant Depot #874 1760 New Durham Rd South Plainfield NJ 07080"]
[null,null,null,880,"Restaurant Depot #880, 765 Old Country Rd, Riverhead, NY. 11901"]
[null,null,null,881,"Restaurant Depot #881 1308 Buckley Road, Syracuse, NY. 13212"]
[null,null,null,882,"Restaurant Depot #882 265 Reverend Moody Overpass Hartford CT 06120"]
[null,null,null,895," Restaurant Depot #895 45 East Wesley Street South Hackensack NJ 07606"]
[]
[null,null,null,"Part #'s","Description"]
[null,null,null,"FRD001","SWEET POTATO FRIES STRAIGHT CUT"]
[null,null,null,"FRD004S","SWEET POTATO FRIES PLATTER CUT"]

{"sheet":"Shipping Check","index":2,"n_rows":33,"n_cols":10,"rows_kept":33,"cut":false,"hidden":false,"merged":[[0,0,0,6],[2,5,2,6],[2,1,2,2],[32,0,32,6],[4,3,4,6]]}
["US COLD SHIPMENT RECONCILIATION"]
[null,null," "]
["Ship Date:"," ",null,null,"Checked By:"," "]
[]
[" ",null," "," "]
["Pallet #'s"," "," ",null,"Placard ","Pallet Label","Product Box"]
[1," "," "," "," "]
[2," "," "," "," ",null,null,null,null," "]
[3," "," "," "," ",null,null," "]
[4," "," "," "," "]
[5," "," "," "," "]
[6," "," "," "," "]
[7," "," "," "," "]
[8," "," "," "," "]
[9," "," "," "," "]
[10," "," "," "," "]
[11," "," "," "," "]
[12," "," "," "," "]
[13," "," "," "," "]
[14," "," "," "," "]
[15," "," "," "," "]
[16," "," "," "," "]
[17," "," "," "," "]
[18," "," "," "," "]
[19," "," "," "," "]
[20," "," "," "," "]
[21," "," "," "," "]
[22," "," "," "," "]
[23," "," "," "," "]
[24," "," "," "," "]
[25]
[26]
["PROD KEY:  FRD001 = STRAIGHT CUT    FRD004S = PLATTER CUT |  PUT A \"X\" IN EACH COLUMN TO CONFIRM MATCH"]

{"sheet":"Pallet 1","index":3,"n_rows":48,"n_cols":7,"rows_kept":48,"cut":false,"hidden":false,"merged":[[0,0,3,7],[5,0,8,7],[18,0,22,1],[18,2,22,7],[37,0,41,3],[37,4,41,7],[43,0,45,7],[47,0,48,7],[11,5,15,7],[11,0,15,4],[25,0,28,4],[31,0,34,2],[31,3,34,4],[31,5,34,5],[31,6,34,7],[25,5,28,7]]}
["JETRO | RESTAURANT DEPOT"]
[]
[]
[]
[null,null," "," "," "]
["CROSS DOCK PLACARD"]
[]
[]
[]
[null," "," "," "," "]
[null," "," "," "," "]
["STORE#",null,null,null,null,{"$f":"'Input Sheet'!D5","v":0}]
[]
[]
[]
[]
[null," "," "," "," "]
[null," "," "," "," "]
["PO#",null,{"$f":"'Input Sheet'!E5","v":0}]
[]
[]
[]
[]
[null," "," "," "," "]
[null," "," "," "," "]
["PALLET #",null,null,null,null,{"$f":"'Input Sheet'!A5","v":1}]
[]
[]
[]
[null," "," "," "," "]
[]
["PALLET",null,null,{"$f":"'Input Sheet'!B5","v":0},null,"OF",{"$f":"'Input Sheet'!C5","v":0}]
[]
[]
[]
[]
[]
["PRODUCT",null,null,null,{"$f":"'Input Sheet'!F5","v":0}]
[]
[]
[]
[]
[]
[{"$f":"'Input Sheet'!G5","v":"Enter Product # in Column f"}]
[]
[]
[]
["KEEP FROZEN - HANDLE WITH CARE"]

{"sheet":"Pallet 2","index":4,"n_rows":48,"n_cols":7,"rows_kept":48,"cut":false,"hidden":false,"merged":[[37,0,41,3],[37,4,41,7],[43,0,45,7],[47,0,48,7],[25,0,28,4],[25,5,28,7],[31,0,34,2],[31,3,34,4],[31,5,34,5],[31,6,34,7],[0,0,3,7],[5,0,8,7],[11,0,15,4],[11,5,15,7],[18,0,22,1],[18,2,22,7]]}
["JETRO | RESTAURANT DEPOT"]
[]
[]
[]
[null,null," "," "," "]
["CROSS DOCK PLACARD"]
[]
[]
[]
[null," "," "," "," "]
[null," "," "," "," "]
["STORE#",null,null,null,null,{"$f":"'Input Sheet'!D6","v":0}]
[]
[]
[]
[]
[null," "," "," "," "]
[null," "," "," "," "]
["PO#",null,{"$f":"'Input Sheet'!E6","v":0}]
[]
[]
[]
[]
[null," "," "," "," "]
[null," "," "," "," "]
["PALLET #",null,null,null,null,{"$f":"'Input Sheet'!A6","v":2}]
[]
[]
[]
[null," "," "," "," "]
[]
["PALLET",null,null,{"$f":"'Input Sheet'!B6","v":0},null,"OF",{"$f":"'Input Sheet'!C6","v":0}]
[]
[]
[]
[]
[]
["PRODUCT",null,null,null,{"$f":"'Input Sheet'!F6","v":0}]
[]
[]
[]
[]
[]
[{"$f":"'Input Sheet'!G6","v":"Enter Product # in Column f"}]
[]
[]
[]
["KEEP FROZEN - HANDLE WITH CARE"]

{"sheet":"Pallet 3","index":5,"n_rows":48,"n_cols":7,"rows_kept":48,"cut":false,"hidden":false,"merged":[[37,0,41,3],[37,4,41,7],[43,0,45,7],[47,0,48,7],[25,0,28,4],[25,5,28,7],[31,0,34,2],[31,3,34,4],[31,5,34,5],[31,6,34,7],[0,0,3,7],[5,0,8,7],[11,0,15,4],[11,5,15,7],[18,0,22,1],[18,2,22,7]]}
["JETRO | RESTAURANT DEPOT"]
[]
[]
[]
[null,null," "," "," "]
["CROSS DOCK PLACARD"]
[]
[]
[]
[null," "," "," "," "]
[null," "," "," "," "]
["STORE#",null,null,null,null,{"$f":"'Input Sheet'!D7","v":0}]
[]
[]
[]
[]
[null," "," "," "," "]
[null," "," "," "," "]
["PO#",null,{"$f":"'Input Sheet'!E7","v":0}]
[]
[]
[]
[]
[null," "," "," "," "]
[null," "," "," "," "]
["PALLET #",null,null,null,null,{"$f":"'Input Sheet'!A7","v":3}]
[]
[]
[]
[null," "," "," "," "]
[]
["PALLET",null,null,{"$f":"'Input Sheet'!B7","v":0},null,"OF",{"$f":"'Input Sheet'!C7","v":0}]
[]
[]
[]
[]
[]
["PRODUCT",null,null,null,{"$f":"'Input Sheet'!F7","v":0}]
[]
[]
[]
[]
[]
[{"$f":"'Input Sheet'!G7","v":"Enter Product # in Column f"}]
[]
[]
[]
["KEEP FROZEN - HANDLE WITH CARE"]

{"sheet":"Pallet 4","index":6,"n_rows":48,"n_cols":7,"rows_kept":48,"cut":false,"hidden":false,"merged":[[37,0,41,3],[37,4,41,7],[43,0,45,7],[47,0,48,7],[25,0,28,4],[25,5,28,7],[31,0,34,2],[31,3,34,4],[31,5,34,5],[31,6,34,7],[0,0,3,7],[5,0,8,7],[11,0,15,4],[11,5,15,7],[18,0,22,1],[18,2,22,7]]}
["JETRO | RESTAURANT DEPOT"]
[]
[]
[]
[null,null," "," "," "]
["CROSS DOCK PLACARD"]
[]
[]
[]
[null," "," "," "," "]
[null," "," "," "," "]
["STORE#",null,null,null,null,{"$f":"'Input Sheet'!D8","v":0}]
[]
[]
[]
[]
[null," "," "," "," "]
[null," "," "," "," "]
["PO#",null,{"$f":"'Input Sheet'!E8","v":0}]
[]
[]
[]
[]
[null," "," "," "," "]
[null," "," "," "," "]
["PALLET #",null,null,null,null,{"$f":"'Input Sheet'!A8","v":4}]
[]
[]
[]
[null," "," "," "," "]
[]
["PALLET",null,null,{"$f":"'Input Sheet'!B8","v":0},null,"OF",{"$f":"'Input Sheet'!C8","v":0}]
[]
[]
[]
[]
[]
["PRODUCT",null,null,null,{"$f":"'Input Sheet'!F8","v":0}]
[]
[]
[]
[]
[]
[{"$f":"'Input Sheet'!G8","v":"Enter Product # in Column f"}]
[]
[]
[]
["KEEP FROZEN - HANDLE WITH CARE"]

{"sheet":"Pallet 5","index":7,"n_rows":48,"n_cols":7,"rows_kept":48,"cut":false,"hidden":false,"merged":[[37,0,41,3],[37,4,41,7],[43,0,45,7],[47,0,48,7],[25,0,28,4],[25,5,28,7],[31,0,34,2],[31,3,34,4],[31,5,34,5],[31,6,34,7],[0,0,3,7],[5,0,8,7],[11,0,15,4],[11,5,15,7],[18,0,22,1],[18,2,22,7]]}
["JETRO | RESTAURANT DEPOT"]
[]
[]
[]
[null,null," "," "," "]
["CROSS DOCK PLACARD"]
[]
[]
[]
[null," "," "," "," "]
[null," "," "," "," "]
["STORE#",null,null,null,null,{"$f":"'Input Sheet'!D9","v":0}]
[]
[]
[]
[]
[null," "," "," "," "]
[null," "," "," "," "]
["PO#",null,{"$f":"'Input Sheet'!E9","v":0}]
[]
[]
[]
[]
[null," "," "," "," "]
[null," "," "," "," "]
["PALLET #",null,null,null,null,{"$f":"'Input Sheet'!A9","v":5}]
[]
[]
[]
[null," "," "," "," "]
[]
["PALLET",null,null,{"$f":"'Input Sheet'!B9","v":0},null,"OF",{"$f":"'Input Sheet'!C9","v":0}]
[]
[]
[]
[]
[]
["PRODUCT",null,null,null,{"$f":"'Input Sheet'!F9","v":0}]
[]
[]
[]
[]
[]
[{"$f":"'Input Sheet'!G9","v":"Enter Product # in Column f"}]
[]
[]
[]
["KEEP FROZEN - HANDLE WITH CARE"]

{"sheet":"Pallet 6","index":8,"n_rows":48,"n_cols":7,"rows_kept":48,"cut":false,"hidden":false,"merged":[[37,0,41,3],[37,4,41,7],[43,0,45,7],[47,0,48,7],[25,0,28,4],[25,5,28,7],[31,0,34,2],[31,3,34,4],[31,5,34,5],[31,6,34,7],[0,0,3,7],[5,0,8,7],[11,0,15,4],[11,5,15,7],[18,0,22,1],[18,2,22,7]]}
["JETRO | RESTAURANT DEPOT"]
[]
[]
[]
[null,null," "," "," "]
["CROSS DOCK PLACARD"]
[]
[]
[]
[null," "," "," "," "]
[null," "," "," "," "]
["STORE#",null,null,null,null,{"$f":"'Input Sheet'!D10","v":0}]
[]
[]
[]
[]
[null," "," "," "," "]
[null," "," "," "," "]
["PO#",null,{"$f":"'Input Sheet'!E10","v":0}]
[]
[]
[]
[]
[null," "," "," "," "]
[null," "," "," "," "]
["PALLET #",null,null,null,null,{"$f":"'Input Sheet'!A10","v":6}]
[]
[]
[]
[null," "," "," "," "]
[]
["PALLET",null,null,{"$f":"'Input Sheet'!B10","v":0},null,"OF",{"$f":"'Input Sheet'!C10","v":0}]
[]
[]
[]
[]
[]
["PRODUCT",null,null,null,{"$f":"'Input Sheet'!F10","v":0}]
[]
[]
[]
[]
[]
[{"$f":"'Input Sheet'!G10","v":"Enter Product # in Column f"}]
[]
[]
[]
["KEEP FROZEN - HANDLE WITH CARE"]

{"sheet":"Pallet 7","index":9,"n_rows":48,"n_cols":7,"rows_kept":48,"cut":false,"hidden":false,"merged":[[37,0,41,3],[37,4,41,7],[43,0,45,7],[47,0,48,7],[25,0,28,4],[25,5,28,7],[31,0,34,2],[31,3,34,4],[31,5,34,5],[31,6,34,7],[0,0,3,7],[5,0,8,7],[11,0,15,4],[11,5,15,7],[18,0,22,1],[18,2,22,7]]}
["JETRO | RESTAURANT DEPOT"]
[]
[]
[]
[null,null," "," "," "]
["CROSS DOCK PLACARD"]
[]
[]
[]
[null," "," "," "," "]
[null," "," "," "," "]
["STORE#",null,null,null,null,{"$f":"'Input Sheet'!D11","v":0}]
[]
[]
[]
[]
[null," "," "," "," "]
[null," "," "," "," "]
["PO#",null,{"$f":"'Input Sheet'!E11","v":0}]
[]
[]
[]
[]
[null," "," "," "," "]
[null," "," "," "," "]
["PALLET #",null,null,null,null,{"$f":"'Input Sheet'!A11","v":7}]
[]
[]
[]
[null," "," "," "," "]
[]
["PALLET",null,null,{"$f":"'Input Sheet'!B11","v":0},null,"OF",{"$f":"'Input Sheet'!C11","v":0}]
[]
[]
[]
[]
[]
["PRODUCT",null,null,null,{"$f":"'Input Sheet'!F11","v":0}]
[]
[]
[]
[]
[]
[{"$f":"'Input Sheet'!G11","v":"Enter Product # in Column f"}]
[]
[]
[]
["KEEP FROZEN - HANDLE WITH CARE"]

{"sheet":"Pallet 8","index":10,"n_rows":48,"n_cols":7,"rows_kept":48,"cut":false,"hidden":false,"merged":[[37,0,41,3],[37,4,41,7],[43,0,45,7],[47,0,48,7],[25,0,28,4],[25,5,28,7],[31,0,34,2],[31,3,34,4],[31,5,34,5],[31,6,34,7],[0,0,3,7],[5,0,8,7],[11,0,15,4],[11,5,15,7],[18,0,22,1],[18,2,22,7]]}
["JETRO | RESTAURANT DEPOT"]
[]
[]
[]
[null,null," "," "," "]
["CROSS DOCK PLACARD"]
[]
[]
[]
[null," "," "," "," "]
[null," "," "," "," "]
["STORE#",null,null,null,null,{"$f":"'Input Sheet'!D12","v":0}]
[]
[]
[]
[]
[null," "," "," "," "]
[null," "," "," "," "]
["PO#",null,{"$f":"'Input Sheet'!E12","v":0}]
[]
[]
[]
[]
[null," "," "," "," "]
[null," "," "," "," "]
["PALLET #",null,null,null,null,{"$f":"'Input Sheet'!A12","v":8}]
[]
[]
[]
[null," "," "," "," "]
[]
["PALLET",null,null,{"$f":"'Input Sheet'!B12","v":0},null,"OF",{"$f":"'Input Sheet'!C12","v":0}]
[]
[]
[]
[]
[]
["PRODUCT",null,null,null,{"$f":"'Input Sheet'!F12","v":0}]
[]
[]
[]
[]
[]
[{"$f":"'Input Sheet'!G12","v":"Enter Product # in Column f"}]
[]
[]
[]
["KEEP FROZEN - HANDLE WITH CARE"]

{"sheet":"Pallet 9","index":11,"n_rows":48,"n_cols":7,"rows_kept":48,"cut":false,"hidden":false,"merged":[[37,0,41,3],[37,4,41,7],[43,0,45,7],[47,0,48,7],[25,0,28,4],[25,5,28,7],[31,0,34,2],[31,3,34,4],[31,5,34,5],[31,6,34,7],[0,0,3,7],[5,0,8,7],[11,0,15,4],[11,5,15,7],[18,0,22,1],[18,2,22,7]]}
["JETRO | RESTAURANT DEPOT"]
[]
[]
[]
[null,null," "," "," "]
["CROSS DOCK PLACARD"]
[]
[]
[]
[null," "," "," "," "]
[null," "," "," "," "]
["STORE#",null,null,null,null,{"$f":"'Input Sheet'!D13","v":0}]
[]
[]
[]
[]
[null," "," "," "," "]
[null," "," "," "," "]
["PO#",null,{"$f":"'Input Sheet'!E13","v":0}]
[]
[]
[]
[]
[null," "," "," "," "]
[null," "," "," "," "]
["PALLET #",null,null,null,null,{"$f":"'Input Sheet'!A13","v":9}]
[]
[]
[]
[null," "," "," "," "]
[]
["PALLET",null,null,{"$f":"'Input Sheet'!B13","v":0},null,"OF",{"$f":"'Input Sheet'!C13","v":0}]
[]
[]
[]
[]
[]
["PRODUCT",null,null,null,{"$f":"'Input Sheet'!F13","v":0}]
[]
[]
[]
[]
[]
[{"$f":"'Input Sheet'!G13","v":"Enter Product # in Column f"}]
[]
[]
[]
["KEEP FROZEN - HANDLE WITH CARE"]

{"sheet":"Pallet 10","index":12,"n_rows":48,"n_cols":7,"rows_kept":48,"cut":false,"hidden":false,"merged":[[37,0,41,3],[37,4,41,7],[43,0,45,7],[47,0,48,7],[25,0,28,4],[25,5,28,7],[31,0,34,2],[31,3,34,4],[31,5,34,5],[31,6,34,7],[0,0,3,7],[5,0,8,7],[11,0,15,4],[11,5,15,7],[18,0,22,1],[18,2,22,7]]}
["JETRO | RESTAURANT DEPOT"]
[]
[]
[]
[null,null," "," "," "]
["CROSS DOCK PLACARD"]
[]
[]
[]
[null," "," "," "," "]
[null," "," "," "," "]
["STORE#",null,null,null,null,{"$f":"'Input Sheet'!D14","v":0}]
[]
[]
[]
[]
[null," "," "," "," "]
[null," "," "," "," "]
["PO#",null,{"$f":"'Input Sheet'!E14","v":0}]
[]
[]
[]
[]
[null," "," "," "," "]
[null," "," "," "," "]
["PALLET #",null,null,null,null,{"$f":"'Input Sheet'!A14","v":10}]
[]
[]
[]
[null," "," "," "," "]
[]
["PALLET",null,null,{"$f":"'Input Sheet'!B14","v":0},null,"OF",{"$f":"'Input Sheet'!C14","v":0}]
[]
[]
[]
[]
[]
["PRODUCT",null,null,null,{"$f":"'Input Sheet'!F14","v":0}]
[]
[]
[]
[]
[]
[{"$f":"'Input Sheet'!G14","v":"Enter Product # in Column f"}]
[]
[]
[]
["KEEP FROZEN - HANDLE WITH CARE"]

{"sheet":"Pallet 11","index":13,"n_rows":48,"n_cols":7,"rows_kept":48,"cut":false,"hidden":false,"merged":[[37,0,41,3],[37,4,41,7],[43,0,45,7],[47,0,48,7],[25,0,28,4],[25,5,28,7],[31,0,34,2],[31,3,34,4],[31,5,34,5],[31,6,34,7],[0,0,3,7],[5,0,8,7],[11,0,15,4],[11,5,15,7],[18,0,22,1],[18,2,22,7]]}
["JETRO | RESTAURANT DEPOT"]
[]
[]
[]
[null,null," "," "," "]
["CROSS DOCK PLACARD"]
[]
[]
[]
[null," "," "," "," "]
[null," "," "," "," "]
["STORE#",null,null,null,null,{"$f":"'Input Sheet'!D15","v":0}]
[]
[]
[]
[]
[null," "," "," "," "]
[null," "," "," "," "]
["PO#",null,{"$f":"'Input Sheet'!E15","v":0}]
[]
[]
[]
[]
[null," "," "," "," "]
[null," "," "," "," "]
["PALLET #",null,null,null,null,{"$f":"'Input Sheet'!A15","v":11}]
[]
[]
[]
[null," "," "," "," "]
[]
["PALLET",null,null,{"$f":"'Input Sheet'!B15","v":0},null,"OF",{"$f":"'Input Sheet'!C15","v":0}]
[]
[]
[]
[]
[]
["PRODUCT",null,null,null,{"$f":"'Input Sheet'!F15","v":0}]
[]
[]
[]
[]
[]
[{"$f":"'Input Sheet'!G15","v":"Enter Product # in Column f"}]
[]
[]
[]
["KEEP FROZEN - HANDLE WITH CARE"]

{"sheet":"Pallet 12","index":14,"n_rows":48,"n_cols":7,"rows_kept":48,"cut":false,"hidden":false,"merged":[[37,0,41,3],[37,4,41,7],[43,0,45,7],[47,0,48,7],[25,0,28,4],[25,5,28,7],[31,0,34,2],[31,3,34,4],[31,5,34,5],[31,6,34,7],[0,0,3,7],[5,0,8,7],[11,0,15,4],[11,5,15,7],[18,0,22,1],[18,2,22,7]]}
["JETRO | RESTAURANT DEPOT"]
[]
[]
[]
[null,null," "," "," "]
["CROSS DOCK PLACARD"]
[]
[]
[]
[null," "," "," "," "]
[null," "," "," "," "]
["STORE#",null,null,null,null,{"$f":"'Input Sheet'!D16","v":0}]
[]
[]
[]
[]
[null," "," "," "," "]
[null," "," "," "," "]
["PO#",null,{"$f":"'Input Sheet'!E16","v":0}]
[]
[]
[]
[]
[null," "," "," "," "]
[null," "," "," "," "]
["PALLET #",null,null,null,null,{"$f":"'Input Sheet'!A16","v":12}]
[]
[]
[]
[null," "," "," "," "]
[]
["PALLET",null,null,{"$f":"'Input Sheet'!B16","v":0},null,"OF",{"$f":"'Input Sheet'!C16","v":0}]
[]
[]
[]
[]
[]
["PRODUCT",null,null,null,{"$f":"'Input Sheet'!F16","v":0}]
[]
[]
[]
[]
[]
[{"$f":"'Input Sheet'!G16","v":"Enter Product # in Column f"}]
[]
[]
[]
["KEEP FROZEN - HANDLE WITH CARE"]

{"sheet":"Pallet 13","index":15,"n_rows":48,"n_cols":7,"rows_kept":48,"cut":false,"hidden":false,"merged":[[37,0,41,3],[37,4,41,7],[43,0,45,7],[47,0,48,7],[25,0,28,4],[25,5,28,7],[31,0,34,2],[31,3,34,4],[31,5,34,5],[31,6,34,7],[0,0,3,7],[5,0,8,7],[11,0,15,4],[11,5,15,7],[18,0,22,1],[18,2,22,7]]}
["JETRO | RESTAURANT DEPOT"]
[]
[]
[]
[null,null," "," "," "]
["CROSS DOCK PLACARD"]
[]
[]
[]
[null," "," "," "," "]
[null," "," "," "," "]
["STORE#",null,null,null,null,{"$f":"'Input Sheet'!D17","v":0}]
[]
[]
[]
[]
[null," "," "," "," "]
[null," "," "," "," "]
["PO#",null,{"$f":"'Input Sheet'!E17","v":0}]
[]
[]
[]
[]
[null," "," "," "," "]
[null," "," "," "," "]
["PALLET #",null,null,null,null,{"$f":"'Input Sheet'!A17","v":13}]
[]
[]
[]
[null," "," "," "," "]
[]
["PALLET",null,null,{"$f":"'Input Sheet'!B17","v":0},null,"OF",{"$f":"'Input Sheet'!C17","v":0}]
[]
[]
[]
[]
[]
["PRODUCT",null,null,null,{"$f":"'Input Sheet'!F17","v":0}]
[]
[]
[]
[]
[]
[{"$f":"'Input Sheet'!G17","v":"Enter Product # in Column f"}]
[]
[]
[]
["KEEP FROZEN - HANDLE WITH CARE"]

{"sheet":"Pallet 14","index":16,"n_rows":48,"n_cols":7,"rows_kept":48,"cut":false,"hidden":false,"merged":[[37,0,41,3],[37,4,41,7],[43,0,45,7],[47,0,48,7],[25,0,28,4],[25,5,28,7],[31,0,34,2],[31,3,34,4],[31,5,34,5],[31,6,34,7],[0,0,3,7],[5,0,8,7],[11,0,15,4],[11,5,15,7],[18,0,22,1],[18,2,22,7]]}
["JETRO | RESTAURANT DEPOT"]
[]
[]
[]
[null,null," "," "," "]
["CROSS DOCK PLACARD"]
[]
[]
[]
[null," "," "," "," "]
[null," "," "," "," "]
["STORE#",null,null,null,null,{"$f":"'Input Sheet'!D18","v":0}]
[]
[]
[]
[]
[null," "," "," "," "]
[null," "," "," "," "]
["PO#",null,{"$f":"'Input Sheet'!E18","v":0}]
[]
[]
[]
[]
[null," "," "," "," "]
[null," "," "," "," "]
["PALLET #",null,null,null,null,{"$f":"'Input Sheet'!A18","v":14}]
[]
[]
[]
[null," "," "," "," "]
[]
["PALLET",null,null,{"$f":"'Input Sheet'!B18","v":0},null,"OF",{"$f":"'Input Sheet'!C18","v":0}]
[]
[]
[]
[]
[]
["PRODUCT",null,null,null,{"$f":"'Input Sheet'!F18","v":0}]
[]
[]
[]
[]
[]
[{"$f":"'Input Sheet'!G18","v":"Enter Product # in Column f"}]
[]
[]
[]
["KEEP FROZEN - HANDLE WITH CARE"]

{"sheet":"Pallet 15","index":17,"n_rows":48,"n_cols":9,"rows_kept":48,"cut":false,"hidden":false,"merged":[[37,0,41,3],[37,4,41,7],[43,0,45,7],[47,0,48,7],[25,0,28,4],[25,5,28,7],[31,0,34,2],[31,3,34,4],[31,5,34,5],[31,6,34,7],[0,0,3,7],[5,0,8,7],[11,0,15,4],[11,5,15,7],[18,0,22,1],[18,2,22,7]]}
["JETRO | RESTAURANT DEPOT"]
[]
[]
[]
[null,null," "," "," "]
["CROSS DOCK PLACARD"]
[]
[]
[]
[null," "," "," "," "]
[null," "," "," "," "]
["STORE#",null,null,null,null,{"$f":"'Input Sheet'!D19","v":0}]
[]
[]
[]
[]
[null," "," "," "," "]
[null," "," "," "," "]
["PO#",null,{"$f":"'Input Sheet'!E19","v":0},null,null,null,null,null," "]
[]
[]
[]
[]
[null," "," "," "," "]
[null," "," "," "," "]
["PALLET #",null,null,null,null,{"$f":"'Input Sheet'!A19","v":15}]
[]
[]
[]
[null," "," "," "," "]
[]
["PALLET",null,null,{"$f":"'Input Sheet'!B19","v":0},null,"OF",{"$f":"'Input Sheet'!C19","v":0}]
[]
[]
[]
[]
[]
["PRODUCT",null,null,null,{"$f":"'Input Sheet'!F19","v":0}]
[]
[]
[]
[]
[]
[{"$f":"'Input Sheet'!G19","v":"Enter Product # in Column f"}]
[]
[]
[]
["KEEP FROZEN - HANDLE WITH CARE"]

{"sheet":"Pallet 16","index":18,"n_rows":48,"n_cols":7,"rows_kept":48,"cut":false,"hidden":false,"merged":[[37,0,41,3],[37,4,41,7],[43,0,45,7],[47,0,48,7],[25,0,28,4],[25,5,28,7],[31,0,34,2],[31,3,34,4],[31,5,34,5],[31,6,34,7],[0,0,3,7],[5,0,8,7],[11,0,15,4],[11,5,15,7],[18,0,22,1],[18,2,22,7]]}
["JETRO | RESTAURANT DEPOT"]
[]
[]
[]
[null,null," "," "," "]
["CROSS DOCK PLACARD"]
[]
[]
[]
[null," "," "," "," "]
[null," "," "," "," "]
["STORE#",null,null,null,null,{"$f":"'Input Sheet'!D20","v":0}]
[]
[]
[]
[]
[null," "," "," "," "]
[null," "," "," "," "]
["PO#",null,{"$f":"'Input Sheet'!E20","v":0}]
[]
[]
[]
[]
[null," "," "," "," "]
[null," "," "," "," "]
["PALLET #",null,null,null,null,{"$f":"'Input Sheet'!A20","v":16}]
[]
[]
[]
[null," "," "," "," "]
[]
["PALLET",null,null,{"$f":"'Input Sheet'!B20","v":0},null,"OF",{"$f":"'Input Sheet'!C20","v":0}]
[]
[]
[]
[]
[]
["PRODUCT",null,null,null,{"$f":"'Input Sheet'!F20","v":0}]
[]
[]
[]
[]
[]
[{"$f":"'Input Sheet'!G20","v":"Enter Product # in Column f"}]
[]
[]
[]
["KEEP FROZEN - HANDLE WITH CARE"]

{"sheet":"Pallet 17","index":19,"n_rows":48,"n_cols":7,"rows_kept":48,"cut":false,"hidden":false,"merged":[[37,0,41,3],[37,4,41,7],[43,0,45,7],[47,0,48,7],[25,0,28,4],[25,5,28,7],[31,0,34,2],[31,3,34,4],[31,5,34,5],[31,6,34,7],[0,0,3,7],[5,0,8,7],[11,0,15,4],[11,5,15,7],[18,0,22,1],[18,2,22,7]]}
["JETRO | RESTAURANT DEPOT"]
[]
[]
[]
[null,null," "," "," "]
["CROSS DOCK PLACARD"]
[]
[]
[]
[null," "," "," "," "]
[null," "," "," "," "]
["STORE#",null,null,null,null,{"$f":"'Input Sheet'!D21","v":0}]
[]
[]
[]
[]
[null," "," "," "," "]
[null," "," "," "," "]
["PO#",null,{"$f":"'Input Sheet'!E21","v":0}]
[]
[]
[]
[]
[null," "," "," "," "]
[null," "," "," "," "]
["PALLET #",null,null,null,null,{"$f":"'Input Sheet'!A21","v":17}]
[]
[]
[]
[null," "," "," "," "]
[]
["PALLET",null,null,{"$f":"'Input Sheet'!B21","v":0},null,"OF",{"$f":"'Input Sheet'!C21","v":0}]
[]
[]
[]
[]
[]
["PRODUCT",null,null,null,{"$f":"'Input Sheet'!F21","v":0}]
[]
[]
[]
[]
[]
[{"$f":"'Input Sheet'!G21","v":"Enter Product # in Column f"}]
[]
[]
[]
["KEEP FROZEN - HANDLE WITH CARE"]

{"sheet":"Pallet 18","index":20,"n_rows":48,"n_cols":7,"rows_kept":48,"cut":false,"hidden":false,"merged":[[37,0,41,3],[37,4,41,7],[43,0,45,7],[47,0,48,7],[25,0,28,4],[25,5,28,7],[31,0,34,2],[31,3,34,4],[31,5,34,5],[31,6,34,7],[0,0,3,7],[5,0,8,7],[11,0,15,4],[11,5,15,7],[18,0,22,1],[18,2,22,7]]}
["JETRO | RESTAURANT DEPOT"]
[]
[]
[]
[null,null," "," "," "]
["CROSS DOCK PLACARD"]
[]
[]
[]
[null," "," "," "," "]
[null," "," "," "," "]
["STORE#",null,null,null,null,{"$f":"'Input Sheet'!D22","v":0}]
[]
[]
[]
[]
[null," "," "," "," "]
[null," "," "," "," "]
["PO#",null,{"$f":"'Input Sheet'!E22","v":0}]
[]
[]
[]
[]
[null," "," "," "," "]
[null," "," "," "," "]
["PALLET #",null,null,null,null,{"$f":"'Input Sheet'!A22","v":18}]
[]
[]
[]
[null," "," "," "," "]
[]
["PALLET",null,null,{"$f":"'Input Sheet'!B22","v":0},null,"OF",{"$f":"'Input Sheet'!C22","v":0}]
[]
[]
[]
[]
[]
["PRODUCT",null,null,null,{"$f":"'Input Sheet'!F22","v":0}]
[]
[]
[]
[]
[]
[{"$f":"'Input Sheet'!G22","v":"Enter Product # in Column f"}]
[]
[]
[]
["KEEP FROZEN - HANDLE WITH CARE"]

{"sheet":"Pallet 19","index":21,"n_rows":48,"n_cols":7,"rows_kept":48,"cut":false,"hidden":false,"merged":[[37,0,41,3],[37,4,41,7],[43,0,45,7],[47,0,48,7],[25,0,28,4],[25,5,28,7],[31,0,34,2],[31,3,34,4],[31,5,34,5],[31,6,34,7],[0,0,3,7],[5,0,8,7],[11,0,15,4],[11,5,15,7],[18,0,22,1],[18,2,22,7]]}
["JETRO | RESTAURANT DEPOT"]
[]
[]
[]
[null,null," "," "," "]
["CROSS DOCK PLACARD"]
[]
[]
[]
[null," "," "," "," "]
[null," "," "," "," "]
["STORE#",null,null,null,null,{"$f":"'Input Sheet'!D23","v":0}]
[]
[]
[]
[]
[null," "," "," "," "]
[null," "," "," "," "]
["PO#",null,{"$f":"'Input Sheet'!E23","v":0}]
[]
[]
[]
[]
[null," "," "," "," "]
[null," "," "," "," "]
["PALLET #",null,null,null,null,{"$f":"'Input Sheet'!A23","v":19}]
[]
[]
[]
[null," "," "," "," "]
[]
["PALLET",null,null,{"$f":"'Input Sheet'!B23","v":0},null,"OF",{"$f":"'Input Sheet'!C23","v":0}]
[]
[]
[]
[]
[]
["PRODUCT",null,null,null,{"$f":"'Input Sheet'!F23","v":0}]
[]
[]
[]
[]
[]
[{"$f":"'Input Sheet'!G23","v":"Enter Product # in Column f"}]
[]
[]
[]
["KEEP FROZEN - HANDLE WITH CARE"]

{"sheet":"Pallet 20","index":22,"n_rows":48,"n_cols":7,"rows_kept":48,"cut":false,"hidden":false,"merged":[[37,0,41,3],[37,4,41,7],[43,0,45,7],[47,0,48,7],[25,0,28,4],[25,5,28,7],[31,0,34,2],[31,3,34,4],[31,5,34,5],[31,6,34,7],[0,0,3,7],[5,0,8,7],[11,0,15,4],[11,5,15,7],[18,0,22,1],[18,2,22,7]]}
["JETRO | RESTAURANT DEPOT"]
[]
[]
[]
[null,null," "," "," "]
["CROSS DOCK PLACARD"]
[]
[]
[]
[null," "," "," "," "]
[null," "," "," "," "]
["STORE#",null,null,null,null,{"$f":"'Input Sheet'!D24","v":0}]
[]
[]
[]
[]
[null," "," "," "," "]
[null," "," "," "," "]
["PO#",null,{"$f":"'Input Sheet'!E24","v":0}]
[]
[]
[]
[]
[null," "," "," "," "]
[null," "," "," "," "]
["PALLET #",null,null,null,null,{"$f":"'Input Sheet'!A24","v":20}]
[]
[]
[]
[null," "," "," "," "]
[]
["PALLET",null,null,{"$f":"'Input Sheet'!B24","v":0},null,"OF",{"$f":"'Input Sheet'!C24","v":0}]
[]
[]
[]
[]
[]
["PRODUCT",null,null,null,{"$f":"'Input Sheet'!F24","v":0}]
[]
[]
[]
[]
[]
[{"$f":"'Input Sheet'!G24","v":"Enter Product # in Column f"}]
[]
[]
[]
["KEEP FROZEN - HANDLE WITH CARE"]

{"sheet":"Pallet 21","index":23,"n_rows":48,"n_cols":7,"rows_kept":48,"cut":false,"hidden":false,"merged":[[37,0,41,3],[37,4,41,7],[43,0,45,7],[47,0,48,7],[25,0,28,4],[25,5,28,7],[31,0,34,2],[31,3,34,4],[31,5,34,5],[31,6,34,7],[0,0,3,7],[5,0,8,7],[11,0,15,4],[11,5,15,7],[18,0,22,1],[18,2,22,7]]}
["JETRO | RESTAURANT DEPOT"]
[]
[]
[]
[null,null," "," "," "]
["CROSS DOCK PLACARD"]
[]
[]
[]
[null," "," "," "," "]
[null," "," "," "," "]
["STORE#",null,null,null,null,{"$f":"'Input Sheet'!D25","v":0}]
[]
[]
[]
[]
[null," "," "," "," "]
[null," "," "," "," "]
["PO#",null,{"$f":"'Input Sheet'!E25","v":0}]
[]
[]
[]
[]
[null," "," "," "," "]
[null," "," "," "," "]
["PALLET #",null,null,null,null,{"$f":"'Input Sheet'!A25","v":21}]
[]
[]
[]
[null," "," "," "," "]
[]
["PALLET",null,null,{"$f":"'Input Sheet'!B25","v":0},null,"OF",{"$f":"'Input Sheet'!C25","v":0}]
[]
[]
[]
[]
[]
["PRODUCT",null,null,null,{"$f":"'Input Sheet'!F25","v":0}]
[]
[]
[]
[]
[]
[{"$f":"'Input Sheet'!G25","v":"Enter Product # in Column f"}]
[]
[]
[]
["KEEP FROZEN - HANDLE WITH CARE"]

{"sheet":"Pallet 22","index":24,"n_rows":48,"n_cols":7,"rows_kept":48,"cut":false,"hidden":false,"merged":[[37,0,41,3],[37,4,41,7],[43,0,45,7],[47,0,48,7],[25,0,28,4],[25,5,28,7],[31,0,34,2],[31,3,34,4],[31,5,34,5],[31,6,34,7],[0,0,3,7],[5,0,8,7],[11,0,15,4],[11,5,15,7],[18,0,22,1],[18,2,22,7]]}
["JETRO | RESTAURANT DEPOT"]
[]
[]
[]
[null,null," "," "," "]
["CROSS DOCK PLACARD"]
[]
[]
[]
[null," "," "," "," "]
[null," "," "," "," "]
["STORE#",null,null,null,null,{"$f":"'Input Sheet'!D26","v":0}]
[]
[]
[]
[]
[null," "," "," "," "]
[null," "," "," "," "]
["PO#",null,{"$f":"'Input Sheet'!E26","v":0}]
[]
[]
[]
[]
[null," "," "," "," "]
[null," "," "," "," "]
["PALLET #",null,null,null,null,{"$f":"'Input Sheet'!A26","v":22}]
[]
[]
[]
[null," "," "," "," "]
[]
["PALLET",null,null,{"$f":"'Input Sheet'!B26","v":0},null,"OF",{"$f":"'Input Sheet'!C26","v":0}]
[]
[]
[]
[]
[]
["PRODUCT",null,null,null,{"$f":"'Input Sheet'!F26","v":0}]
[]
[]
[]
[]
[]
[{"$f":"'Input Sheet'!G26","v":"Enter Product # in Column f"}]
[]
[]
[]
["KEEP FROZEN - HANDLE WITH CARE"]

{"sheet":"Pallet 23","index":25,"n_rows":48,"n_cols":7,"rows_kept":48,"cut":false,"hidden":false,"merged":[[37,0,41,3],[37,4,41,7],[43,0,45,7],[47,0,48,7],[25,0,28,4],[25,5,28,7],[31,0,34,2],[31,3,34,4],[31,5,34,5],[31,6,34,7],[0,0,3,7],[5,0,8,7],[11,0,15,4],[11,5,15,7],[18,0,22,1],[18,2,22,7]]}
["JETRO | RESTAURANT DEPOT"]
[]
[]
[]
[null,null," "," "," "]
["CROSS DOCK PLACARD"]
[]
[]
[]
[null," "," "," "," "]
[null," "," "," "," "]
["STORE#",null,null,null,null,{"$f":"'Input Sheet'!D27","v":0}]
[]
[]
[]
[]
[null," "," "," "," "]
[null," "," "," "," "]
["PO#",null,{"$f":"'Input Sheet'!E27","v":0}]
[]
[]
[]
[]
[null," "," "," "," "]
[null," "," "," "," "]
["PALLET #",null,null,null,null,{"$f":"'Input Sheet'!A27","v":23}]
[]
[]
[]
[null," "," "," "," "]
[]
["PALLET",null,null,{"$f":"'Input Sheet'!B27","v":0},null,"OF",{"$f":"'Input Sheet'!C27","v":0}]
[]
[]
[]
[]
[]
["PRODUCT",null,null,null,{"$f":"'Input Sheet'!F27","v":0}]
[]
[]
[]
[]
[]
[{"$f":"'Input Sheet'!G27","v":"Enter Product # in Column f"}]
[]
[]
[]
["KEEP FROZEN - HANDLE WITH CARE"]

{"sheet":"Pallet 24","index":26,"n_rows":48,"n_cols":7,"rows_kept":48,"cut":false,"hidden":false,"merged":[[37,0,41,3],[37,4,41,7],[43,0,45,7],[47,0,48,7],[25,0,28,4],[25,5,28,7],[31,0,34,2],[31,3,34,4],[31,5,34,5],[31,6,34,7],[0,0,3,7],[5,0,8,7],[11,0,15,4],[11,5,15,7],[18,0,22,1],[18,2,22,7]]}
["JETRO | RESTAURANT DEPOT"]
[]
[]
[]
[null,null," "," "," "]
["CROSS DOCK PLACARD"]
[]
[]
[]
[null," "," "," "," "]
[null," "," "," "," "]
["STORE#",null,null,null,null,{"$f":"'Input Sheet'!D28","v":0}]
[]
[]
[]
[]
[null," "," "," "," "]
[null," "," "," "," "]
["PO#",null,{"$f":"'Input Sheet'!E28","v":0}]
[]
[]
[]
[]
[null," "," "," "," "]
[null," "," "," "," "]
["PALLET #",null,null,null,null,{"$f":"'Input Sheet'!A28","v":24}]
[]
[]
[]
[null," "," "," "," "]
[]
["PALLET",null,null,{"$f":"'Input Sheet'!B28","v":0},null,"OF",{"$f":"'Input Sheet'!C28","v":0}]
[]
[]
[]
[]
[]
["PRODUCT",null,null,null,{"$f":"'Input Sheet'!F28","v":0}]
[]
[]
[]
[]
[]
[{"$f":"'Input Sheet'!G28","v":"Enter Product # in Column f"}]
[]
[]
[]
["KEEP FROZEN - HANDLE WITH CARE"]

{"sheet":"Pallet 25","index":27,"n_rows":48,"n_cols":7,"rows_kept":48,"cut":false,"hidden":false,"merged":[[37,0,41,3],[37,4,41,7],[43,0,45,7],[47,0,48,7],[25,0,28,4],[25,5,28,7],[31,0,34,2],[31,3,34,4],[31,5,34,5],[31,6,34,7],[0,0,3,7],[5,0,8,7],[11,0,15,4],[11,5,15,7],[18,0,22,1],[18,2,22,7]]}
["JETRO | RESTAURANT DEPOT"]
[]
[]
[]
[null,null," "," "," "]
["CROSS DOCK PLACARD"]
[]
[]
[]
[null," "," "," "," "]
[null," "," "," "," "]
["STORE#",null,null,null,null,{"$f":"'Input Sheet'!D29","v":0}]
[]
[]
[]
[]
[null," "," "," "," "]
[null," "," "," "," "]
["PO#",null,{"$f":"'Input Sheet'!E29","v":0}]
[]
[]
[]
[]
[null," "," "," "," "]
[null," "," "," "," "]
["PALLET #",null,null,null,null,{"$f":"'Input Sheet'!A29","v":25}]
[]
[]
[]
[null," "," "," "," "]
[]
["PALLET",null,null,{"$f":"'Input Sheet'!B29","v":0},null,"OF",{"$f":"'Input Sheet'!C29","v":0}]
[]
[]
[]
[]
[]
["PRODUCT",null,null,null,{"$f":"'Input Sheet'!F29","v":0}]
[]
[]
[]
[]
[]
[{"$f":"'Input Sheet'!G29","v":"Enter Product # in Column f"}]
[]
[]
[]
["KEEP FROZEN - HANDLE WITH CARE"]

{"sheet":"Pallet 26","index":28,"n_rows":48,"n_cols":7,"rows_kept":48,"cut":false,"hidden":false,"merged":[[37,0,41,3],[37,4,41,7],[43,0,45,7],[47,0,48,7],[25,0,28,4],[25,5,28,7],[31,0,34,2],[31,3,34,4],[31,5,34,5],[31,6,34,7],[0,0,3,7],[5,0,8,7],[11,0,15,4],[11,5,15,7],[18,0,22,1],[18,2,22,7]]}
["JETRO | RESTAURANT DEPOT"]
[]
[]
[]
[null,null," "," "," "]
["CROSS DOCK PLACARD"]
[]
[]
[]
[null," "," "," "," "]
[null," "," "," "," "]
["STORE#",null,null,null,null,{"$f":"'Input Sheet'!D30","v":0}]
[]
[]
[]
[]
[null," "," "," "," "]
[null," "," "," "," "]
["PO#",null,{"$f":"'Input Sheet'!E30","v":0}]
[]
[]
[]
[]
[null," "," "," "," "]
[null," "," "," "," "]
["PALLET #",null,null,null,null,{"$f":"'Input Sheet'!A30","v":26}]
[]
[]
[]
[null," "," "," "," "]
[]
["PALLET",null,null,{"$f":"'Input Sheet'!B30","v":0},null,"OF",{"$f":"'Input Sheet'!C30","v":0}]
[]
[]
[]
[]
[]
["PRODUCT",null,null,null,{"$f":"'Input Sheet'!F30","v":0}]
[]
[]
[]
[]
[]
[{"$f":"'Input Sheet'!G30","v":"Enter Product # in Column f"}]
[]
[]
[]
["KEEP FROZEN - HANDLE WITH CARE"]